Target
P2X purinoceptor 3
Ligand
BDBM246636
Substrate
Meas. Tech.
Receptor Inhibition Assay
pH
7.5±n/a
IC50
6.00±n/a nM
Comments
extracted
Citation
 Kai, HTanaka, SHiramatsu, YNozu, ANakamura, K Heterocyclic ring and carbocyclic derivative US Patent  US9550763 Publication Date 1/24/2017 
Target
Name:
P2X purinoceptor 3
Synonyms:
ATP receptor P2RX3 P2X purinoceptor 3 P2X purinoceptor 3 (P2X3) P2X3 purinoceptor p2x3 + hsa
Type:
Protein
Mol. Mass.:
44292.02
Organism:
Homo sapiens (Human)
Description:
P56373
Residue:
397
  
Inhibitor
Name:
BDBM246636
Synonyms:
US9550763, Compound I-282
Type:
Small organic molecule
Emp. Form.:
C29H28FN5O4
Mol. Mass.:
529.5621
SMILES:
Cc1ccc(Cn2cc(C(=O)NC3CCOCC3)c(=O)nc2Nc2ccc(Oc3cccc(F)n3)cc2)cc1
: