Target
P2X purinoceptor 3
Ligand
BDBM246670
Substrate
Meas. Tech.
Receptor Inhibition Assay
pH
7.5±n/a
IC50
26.0±n/a nM
Comments
extracted
Citation
 Kai, HTanaka, SHiramatsu, YNozu, ANakamura, K Heterocyclic ring and carbocyclic derivative US Patent  US9550763 Publication Date 1/24/2017 
Target
Name:
P2X purinoceptor 3
Synonyms:
ATP receptor P2RX3 P2X purinoceptor 3 P2X purinoceptor 3 (P2X3) P2X3 purinoceptor p2x3 + hsa
Type:
Protein
Mol. Mass.:
44292.02
Organism:
Homo sapiens (Human)
Description:
P56373
Residue:
397
  
Inhibitor
Name:
BDBM246670
Synonyms:
US9550763, Compound I-323
Type:
Small organic molecule
Emp. Form.:
C28H26ClFN4O5
Mol. Mass.:
552.981
SMILES:
COC(=O)[C@H](C)[C@H](C)n1c(=O)cc(Nc2ccc(Oc3ccc(F)cn3)cc2)n(Cc2ccc(Cl)cc2)c1=O
: