Target
Isocitrate dehydrogenase [NADP] cytoplasmic [R132C]
Ligand
BDBM363543
Substrate
Meas. Tech.
In Vitro Assay
IC50
<500±n/a nM
Citation
 Popovici-Muller, JLemieux, RMTravins, JCai, ZCui, DZhou, D Therapeutically active compositions and their methods of use US Patent  US9850277 Publication Date 12/26/2017 
Target
Name:
Isocitrate dehydrogenase [NADP] cytoplasmic [R132C]
Synonyms:
IDH1 IDH1(R132C) Isocitrate dehydrogenase (IDH1)(R132C) Isocitrate dehydrogenase [NADP] cytoplasmic (IDH1) (R132C) | PICD
Type:
Enzyme Catalytic Domain
Mol. Mass.:
46607.23
Organism:
Homo sapiens (Human)
Description:
O75874[R132C]
Residue:
414
  
Inhibitor
Name:
BDBM363543
Synonyms:
US10640534, Compound 35 US10717764, Compound 35 US11667673, Compound 35 | US9850277, Compound 35
Type:
Small organic molecule
Emp. Form.:
C28H23Cl2F3N4O3
Mol. Mass.:
591.408
SMILES:
Fc1cccc(c1)N([C@H](C(=O)NC1CC(F)(F)C1)c1ccccc1Cl)C(=O)[C@@H]1CCC(=O)N1c1cccc(Cl)n1
: