Target
Estrogen receptor beta
Ligand
BDBM19982
Substrate
17beta-estradiol (E2)
Meas. Tech.
Estrogen Receptor Binding Assay.
pH
7.5±n/a
Temperature
295.15±n/a K
Ki
0.44±0.26 nM
Citation
 Richardson, TIDodge, JADurst, GLPfeifer, LAShah, JWang, YDurbin, JDKrishnan, VNorman, BH Benzopyrans as selective estrogen receptor beta agonists (SERBAs). Part 3: synthesis of cyclopentanone and cyclohexanone intermediates for C-ring modification. Bioorg Med Chem Lett 17:4824-8 (2007)  
Target
Name:
Estrogen receptor beta
Synonyms:
ER-beta ESR2_HUMAN Estradiol receptor beta (ERβ) Estrogen receptor (ER beta) Estrogen receptor beta (ER beta) NR3A2 estrogen beta
Type:
Protein
Mol. Mass.:
59238.43
Organism:
Homo sapiens (Human)
Description:
Q92731
Residue:
530
  
Inhibitor
Name:
BDBM19982
Synonyms:
(2R,6S,7R)-4,4-difluoro-7-(4-hydroxyphenyl)-8-oxatricyclo[7.4.0.0^{2,6}]trideca-1(9),10,12-trien-12-ol C-ring modified benzopyran scaffold, 2b
Type:
Small organic molecule
Emp. Form.:
C18H16F2O3
Mol. Mass.:
318.3146
SMILES:
Oc1ccc(cc1)[C@@H]1Oc2ccc(O)cc2[C@@H]2CC(F)(F)C[C@H]12
:
Substrate
Name:
BDBM17292
Synonyms:
(1S,10R,11S,14S,15S)-15-methyltetracyclo[8.7.0.0^{2,7}.0^{11,15}]heptadeca-2,4,6-triene-5,14-diol 17α-ethinylestradiol CHEMBL135 ESTRADIOL Ovocyclin US9040509, E2 US9561238, E2 [2,4,6,7-3H]-E2 [3H]]estradiol
Type:
Steroid
Emp. Form.:
C18H24O2
Mol. Mass.:
272.382
SMILES:
[H][C@@]12CC[C@H](O)[C@@]1(C)CC[C@]1([H])c3ccc(O)cc3CC[C@@]21[H]
: