Target
Oxysterols receptor LXR-alpha [197-447]
Ligand
BDBM19996
Substrate
BDBM19993
Meas. Tech.
LXR Binding Assay
pH
7.4±n/a
Temperature
277.15±n/a K
IC50
>1000±n/a nM
Citation
 Hu, BCollini, MUnwalla, RMiller, CSinghaus, RQuinet, ESavio, DHalpern, ABasso, MKeith, JClerin, VChen, LResmini, CLiu, QYFeingold, IHuselton, CAzam, FFarnegardh, MEnroth, CBonn, TGoos-Nilsson, AWilhelmsson, ANambi, PWrobel, J Discovery of phenyl acetic acid substituted quinolines as novel liver X receptor agonists for the treatment of atherosclerosis. J Med Chem 49:6151-4 (2006)  
Target
Name:
Oxysterols receptor LXR-alpha [197-447]
Synonyms:
LXRA NR1H3 Nuclear orphan receptor LXR-alpha Oxysterols receptor LXR-alpha
Type:
Receptor
Mol. Mass.:
28986.41
Organism:
Homo sapiens (Human)
Description:
LXR alpha ligand binding domain (amino acid residues 197-447) with an N-terminal biotinylation tag expressed in E.coli, was used for the binding assays.
Residue:
251
  
Inhibitor
Name:
BDBM19996
Synonyms:
Quinoline 11 | methyl 4-{3-[3-benzoyl-8-(trifluoromethyl)quinolin-4-yl]phenoxymethyl}benzoate
Type:
Small organic molecule
Emp. Form.:
C32H22F3NO4
Mol. Mass.:
541.5166
SMILES:
COC(=O)c1ccc(COc2cccc(c2)-c2c(cnc3c(cccc23)C(F)(F)F)C(=O)c2ccccc2)cc1
:
Substrate
Name:
BDBM19993
Synonyms:
CHEMBL62136 T 0901317 TO-901317 US10669296, Compound TO901317 [3H]T0901317
Type:
Small organic molecule
Emp. Form.:
C17H12F9NO3S
Mol. Mass.:
481.333
SMILES:
OC(c1ccc(cc1)N(CC(F)(F)F)S(=O)(=O)c1ccccc1)(C(F)(F)F)C(F)(F)F
: