Target
Oxysterols receptor LXR-beta [154-461]
Ligand
BDBM20001
Substrate
BDBM19993
Meas. Tech.
LXR Binding Assay
IC50
1.9±n/a nM
EC50
33±n/a nM
Citation
 Hu, BJetter, JKaufman, DSinghaus, RBernotas, RUnwalla, RQuinet, ESavio, DHalpern, ABasso, MKeith, JClerin, VChen, LLiu, QYFeingold, IHuselton, CAzam, FGoos-Nilsson, AWilhelmsson, ANambi, PWrobel, J Further modification on phenyl acetic acid based quinolines as liver X receptor modulators. Bioorg Med Chem 15:3321-33 (2007)  
Target
Name:
Oxysterols receptor LXR-beta [154-461]
Synonyms:
LXRB NER NR1H2_HUMAN Nuclear receptor NER Oxysterols receptor LXR-beta Ubiquitously-expressed nuclear receptor
Type:
Receptor
Mol. Mass.:
34695.52
Organism:
Homo sapiens (Human)
Description:
LXR beta ligand binding domain (amino acid residues 154-461) with an N-terminal biotinylation tag expressed in E.coli, was used for the binding assays.
Residue:
308
  
Inhibitor
Name:
BDBM20001
Synonyms:
2-{4-[({3-[3-benzyl-8-(trifluoromethyl)quinolin-4-yl]phenyl}amino)methyl]phenyl}acetic acid JMC517161 Compound 4 | Quinoline 16
Type:
Small organic molecule
Emp. Form.:
C32H25F3N2O2
Mol. Mass.:
526.5483
SMILES:
OC(=O)Cc1ccc(CNc2cccc(c2)-c2c(Cc3ccccc3)cnc3c(cccc23)C(F)(F)F)cc1
:
Substrate
Name:
BDBM19993
Synonyms:
CHEMBL62136 T 0901317 TO-901317 US10669296, Compound TO901317 [3H]T0901317
Type:
Small organic molecule
Emp. Form.:
C17H12F9NO3S
Mol. Mass.:
481.333
SMILES:
OC(c1ccc(cc1)N(CC(F)(F)F)S(=O)(=O)c1ccccc1)(C(F)(F)F)C(F)(F)F
: