Target
AP-4-A phosphorylase
Ligand
BDBM65562
Substrate
Meas. Tech.
FRET assay
pH
8±n/a
IC50
1820±480 nM
Comments
extracted
Citation
 Götz, KHHacker, SMMayer, DDürig, JNStenger, SMarx, A Inhibitors of the Diadenosine Tetraphosphate Phosphorylase Rv2613c of Mycobacterium tuberculosis. ACS Chem Biol 12:2682-2689 (2017)  
Target
Name:
AP-4-A phosphorylase
Synonyms:
AP,A phosphorylase ATP adenylyltransferase
Type:
Protein
Mol. Mass.:
21869.52
Organism:
Mycobacterium tuberculosis (strain ATCC 25618 / H37Rv)
Description:
P9WMK9
Residue:
195
  
Inhibitor
Name:
BDBM65562
Synonyms:
Synthesized Sulfanylacrylonitril Derivatives 9
Type:
Small organic molecule
Emp. Form.:
C19H14F6N2O2S2
Mol. Mass.:
480.447
SMILES:
CCS\C(Nc1cc(cc(c1)C(F)(F)F)C(F)(F)F)=C(\C#N)S(=O)(=O)c1ccccc1
: