Target
Papain
Ligand
BDBM20085
Substrate
BDBM20081
Meas. Tech.
Papain Inhibition Assay
pH
6.5±n/a
Temperature
298.15±n/a K
Ki
2000±100 nM
Km
965000±244000 nM
Citation
 Löser, RSchilling, KDimmig, EGütschow, M Interaction of papain-like cysteine proteases with dipeptide-derived nitriles. J Med Chem 48:7688-707 (2005)  
Target
Name:
Papain
Synonyms:
Allergen=Car p 1 PPI | Papaya proteinase I
Type:
Enzyme
Mol. Mass.:
38923.01
Organism:
Carica papaya
Description:
Papain was purchased from Sigma, Germany.
Residue:
345
  
Inhibitor
Name:
BDBM20085
Synonyms:
dipeptide-derived nitrile, 5 | tert-butyl N-[(1S)-1-[(cyanomethyl)carbamoyl]-2-methylpropyl]carbamate
Type:
Small organic molecule
Emp. Form.:
C12H21N3O3
Mol. Mass.:
255.3134
SMILES:
CC(C)[C@H](NC(=O)OC(C)(C)C)C(=O)NCC#N
:
Substrate
Name:
BDBM20081
Synonyms:
Z-Phe-Arg-NH-4-nitrophenyl | Z-Phe-Arg-NHNp
Type:
Emp. Form.:
Mol. Mass.:
SMILES:
: