Target
Papain
Ligand
BDBM20108
Substrate
BDBM20081
Meas. Tech.
Papain Inhibition Assay
pH
6.5±n/a
Temperature
298.15±n/a K
Ki
330±20 nM
Km
965000±244000 nM
Citation
 Löser, RSchilling, KDimmig, EGütschow, M Interaction of papain-like cysteine proteases with dipeptide-derived nitriles. J Med Chem 48:7688-707 (2005)  
Target
Name:
Papain
Synonyms:
Allergen=Car p 1 PPI | Papaya proteinase I
Type:
Enzyme
Mol. Mass.:
38923.01
Organism:
Carica papaya
Description:
Papain was purchased from Sigma, Germany.
Residue:
345
  
Inhibitor
Name:
BDBM20108
Synonyms:
dipeptide-derived nitrile, 29 | tert-butyl N-[(1S)-2-(3-bromophenyl)-1-[(cyanomethyl)carbamoyl]ethyl]carbamate
Type:
Small organic molecule
Emp. Form.:
C16H20BrN3O3
Mol. Mass.:
382.252
SMILES:
CC(C)(C)OC(=O)N[C@@H](Cc1cccc(Br)c1)C(=O)NCC#N
:
Substrate
Name:
BDBM20081
Synonyms:
Z-Phe-Arg-NH-4-nitrophenyl | Z-Phe-Arg-NHNp
Type:
Emp. Form.:
Mol. Mass.:
SMILES:
: