Target
Oxysterols receptor LXR-beta
Ligand
BDBM19993
Substrate
biotinylated SRC-1 peptide
Meas. Tech.
Cell-Free Ligand Sensing Assay (LiSA)-LXRbeta-SRC1 Assay
pH
7.5±n/a
Temperature
295.15±n/a K
EC50
30±10 nM
Citation
 Jaye, MCKrawiec, JACampobasso, NSmallwood, AQiu, CLu, QKerrigan, JJDe Los Frailes Alvaro, MLaffitte, BLiu, WSMarino, JPMeyer, CRNichols, JAParks, DJPerez, PSarov-Blat, LSeepersaud, SDSteplewski, KMThompson, SKWang, PWatson, MAWebb, CLHaigh, DCaravella, JAMacphee, CHWillson, TMCollins, JL Discovery of substituted maleimides as liver X receptor agonists and determination of a ligand-bound crystal structure. J Med Chem 48:5419-22 (2005)  
Target
Name:
Oxysterols receptor LXR-beta
Synonyms:
LXRB Liver X, LXR beta NR1H2 Nuclear receptor NER Ubiquitously-expressed nuclear receptor
Type:
Enzyme Catalytic Domain
Mol. Mass.:
50978.79
Organism:
Homo sapiens (Human)
Description:
P55055
Residue:
460
  
Inhibitor
Name:
BDBM19993
Synonyms:
CHEMBL62136 T 0901317 TO-901317 US10669296, Compound TO901317 [3H]T0901317
Type:
Small organic molecule
Emp. Form.:
C17H12F9NO3S
Mol. Mass.:
481.333
SMILES:
OC(c1ccc(cc1)N(CC(F)(F)F)S(=O)(=O)c1ccccc1)(C(F)(F)F)C(F)(F)F
:
Substrate
Name:
biotinylated SRC-1 peptide
Synonyms:
Type:
Peptide
Mol. Mass.:
3157.52
Organism:
Description:
A biotinylated peptide comprises amino acids 675-699 of steroid receptor coactivator 1 (SRC1).
Residue:
28