Target
P2X purinoceptor 7
Ligand
BDBM246865
Substrate
Meas. Tech.
P2X7 Radioligand Binding
Ki
1.60±n/a nM
Citation
 Ameriks, MKRech, JCSavall, BMWall, JL Substituted [1,2,4]triazolo[4,3-a]pyrazines as P2X7 modulators US Patent  US10053463 Publication Date 8/21/2018 
Target
Name:
P2X purinoceptor 7
Synonyms:
ATP receptor P2RX7_HUMAN P2X purinoceptor 7 (P2X7) P2Z receptor | Purinergic receptor
Type:
Protein
Mol. Mass.:
68602.85
Organism:
Homo sapiens (Human)
Description:
Q99572
Residue:
595
  
Inhibitor
Name:
BDBM246865
Synonyms:
6-(trifluoromethyl)picolinohydrazide | US10053463, 16
Type:
Small organic molecule
Emp. Form.:
C7H6F3N3O
Mol. Mass.:
205.1372
SMILES:
NNC(=O)c1cccc(n1)C(F)(F)F
: