Target
Mu-type opioid receptor
Ligand
BDBM21010
Substrate
BDBM21015
Meas. Tech.
Radioligand Labeled Binding Assay and [35S]GTP-gamma-S Binding Assay
pH
7.4±n/a
Temperature
298.15±n/a K
Ki
0.65±n/a nM
EC50
0.71±n/a nM
Citation
 Yamamoto, TNair, PVagner, JLargent-Milnes, TDavis, PMa, SWNavratilova, EMoye, STumati, SLai, JYamamura, HIVanderah, TWPorreca, FHruby, VJ A Structure-Activity Relationship Study and Combinatorial Synthetic Approach of C-Terminal Modified Bifunctional Peptides That Are delta/mu Opioid Receptor Agonists and Neurokinin 1 Receptor Antagonists. J Med Chem 51:1369-76 (2008)  
Target
Name:
Mu-type opioid receptor
Synonyms:
MOR-1 Mu-type opioid receptor (MOR) OPRM_RAT Opioid receptor B Ror-b
Type:
G Protein-Coupled Receptor (GPCR)
Mol. Mass.:
44503.11
Organism:
Rattus norvegicus (rat)
Description:
Competition binding assays were carried out using membrane preparations from transfected HN9.10 cells that constitutively expressed the mu opioid receptor.
Residue:
398
  
Inhibitor
Name:
BDBM21010
Synonyms:
(2S)-2-{[(2S)-1-[(2S)-2-{2-[(2R)-2-[(2S)-2-amino-3-(4-hydroxyphenyl)propanamido]propanamido]acetamido}-3-phenylpropanoyl]pyrrolidin-2-yl]formamido}-N-[(1S)-1-(benzylcarbamoyl)-2-(1H-indol-3-yl)ethyl]-4-methylpentanamide H-Tyr-D-Ala-Gly-Phe-Pro-Leu-Trp-NH-Bzl
Type:
Peptide-like ligand
Emp. Form.:
C52H63N9O8
Mol. Mass.:
942.1121
SMILES:
CC(C)C[C@H](NC(=O)[C@@H]1CCCN1C(=O)[C@H](Cc1ccccc1)NC(=O)CNC(=O)[C@@H](C)NC(=O)[C@@H](N)Cc1ccc(O)cc1)C(=O)N[C@@H](Cc1c[nH]c2ccccc12)C(=O)NCc1ccccc1
:
Substrate
Name:
BDBM21015
Synonyms:
(2S)-2-{2-[(2R)-2-[(2S)-2-amino-3-(4-hydroxyphenyl)propanamido]propanamido]-N-methylacetamido}-N-(2-hydroxyethyl)-3-phenylpropanamide CHEMBL38874 DAMGO US11492374, ID 2 [tyrosyl-3,5-3H(N)]-D-Ala2-Mephe4-glyol5-enkephalin
Type:
Analgesics
Emp. Form.:
C26H35N5O6
Mol. Mass.:
513.586
SMILES:
C[C@@H](NC(=O)[C@@H](N)Cc1ccc(O)cc1)C(=O)NCC(=O)N(C)[C@@H](Cc1ccccc1)C(=O)NCCO
: