Target
Vascular endothelial growth factor receptor 2
Ligand
BDBM21093
Substrate
biotinylated peptide substrate
Meas. Tech.
HTRF Assay of Receptor Tyrosine Kinase and Cellular KDR Phosphorylation Assay
pH
7.5±n/a
Temperature
295.15±n/a K
IC50
134±n/a nM
EC50
23±n/a nM
Citation
 Ji, ZAhmed, AAAlbert, DHBouska, JJBousquet, PFCunha, GADiaz, GGlaser, KBGuo, JHarris, CMLi, JMarcotte, PAMoskey, MDOie, TPease, LSoni, NBStewart, KDDavidsen, SKMichaelides, MR 3-Amino-benzo[d]isoxazoles as Novel Multitargeted Inhibitors of Receptor Tyrosine Kinases. J Med Chem 51:1231-41 (2008)  
Target
Name:
Vascular endothelial growth factor receptor 2
Synonyms:
CD_antigen=CD309 Fetal liver kinase 1 (FLK-1) KDR Protein-tyrosine kinase receptor Flk-1 VEGFR-2 VEGFR2 Vascular Endothelial Growth Factor Receptor Kinase 2 Vascular endothelial growth factor receptor 2 (KDR) Vascular endothelial growth factor receptor 2 (VEGFR2) Vascular endothelial growth factor receptor-2 (VEGFR-2)
Type:
Receptor Tyrosine Kinase
Mol. Mass.:
151510.97
Organism:
Homo sapiens (Human)
Description:
P35968
Residue:
1356
  
Inhibitor
Name:
BDBM21093
Synonyms:
3-[4-(3-amino-1,2-benzoxazol-4-yl)phenyl]-1-(4-fluorophenyl)urea | Aminobenzoisoxazole, 36
Type:
Small organic molecule
Emp. Form.:
C20H15FN4O2
Mol. Mass.:
362.3571
SMILES:
Nc1noc2cccc(-c3ccc(NC(=O)Nc4ccc(F)cc4)cc3)c12
:
Substrate
Name:
biotinylated peptide substrate
Synonyms:
Type:
Peptide
Mol. Mass.:
2470.20
Organism:
Description:
Residue:
21