Target
VIM-1 protein
Ligand
BDBM367939
Substrate
Meas. Tech.
Enzyme Activity
IC50
0.477±n/a nM
Citation
 Bennett, FJiang, JPasternak, ADong, SGu, XScott, JDTang, HZhao, ZHuang, YHunter, DYang, DYoung, KXiao, LZhang, ZFu, JBai, YZheng, ZZhang, X Metallo-beta-lactamase inhibitors US Patent  US10227331 Publication Date 3/12/2019 
Target
Name:
VIM-1 protein
Synonyms:
Beta-lactamase VIM-1 Metallo-beta-lactamase VIM-1 VIM-1 VIM-1 metallo-beta-lactamase | VIM-1 protein
Type:
Enzyme Catalytic Domain
Mol. Mass.:
28014.53
Organism:
Pseudomonas aeruginosa
Description:
Residue:
266
  
Inhibitor
Name:
BDBM367939
Synonyms:
3-((4-(3-methyl-1H- indazol-5-yl)-2- sulfamoyl-3-(1H- tetrazol-5- yl)phenyl)sulfonyl)azetidin- 1-ium 2,2,2- trifluoroacetate | US10227331, Example 126
Type:
Small organic molecule
Emp. Form.:
C18H18N8O4S2
Mol. Mass.:
474.517
SMILES:
Cc1n[nH]c2ccc(cc12)-c1ccc(c(c1-c1nnn[nH]1)S(N)(=O)=O)S(=O)(=O)C1CNC1
: