Target
Adenosine receptor A1
Ligand
BDBM21213
Substrate
BDBM21173
Meas. Tech.
Human A1 Adenosine Receptor Binding Assay
pH
7.4±n/a
Temperature
298.15±n/a K
Ki
>10000±n/a nM
Citation
 Cosimelli, BGreco, GEhlardo, MNovellino, EDa Settimo, FTaliani, SLa Motta, CBellandi, MTuccinardi, TMartinelli, ACiampi, OTrincavelli, MLMartini, C Derivatives of 4-Amino-6-hydroxy-2-mercaptopyrimidine as Novel, Potent, and Selective A3 Adenosine Receptor Antagonists. J Med Chem 51:1764-70 (2008)  
Target
Name:
Adenosine receptor A1
Synonyms:
A1 adenosine receptor (hA1) AA1R_HUMAN ADORA1 Adenosine A1-receptor Adenosine receptor A1 (hA1) | Adenosine transporter (AdT)
Type:
G Protein-Coupled Receptor (GPCR)
Mol. Mass.:
36520.92
Organism:
Homo sapiens (Human)
Description:
P30542
Residue:
326
  
Inhibitor
Name:
BDBM21213
Synonyms:
2,2 -(4H-1,2,4-triazole-3,5-diyl)dipyridine 2-[5-(pyridin-2-yl)-4H-1,2,4-triazol-3-yl]pyridine triazole-dipyridine, A
Type:
Small organic molecule
Emp. Form.:
C12H9N5
Mol. Mass.:
223.2334
SMILES:
c1ccc(nc1)-c1nnc([nH]1)-c1ccccn1
:
Substrate
Name:
BDBM21173
Synonyms:
1,3-dipropyl-8-cyclopentylxanthine CHEMBL183 PD116948 | [3H]DPCPX
Type:
radiolabeled ligand
Emp. Form.:
C16H24N4O2
Mol. Mass.:
304.3874
SMILES:
CCCn1c2nc([nH]c2c(=O)n(CCC)c1=O)C1CCCC1
: