Target
Mast/stem cell growth factor receptor Kit [D816V]
Ligand
BDBM369338
Substrate
Meas. Tech.
Cell-Based Assays of c-Kit Mutant Kinase Activity
Ki
500±n/a nM
Citation
 Lin, JBuell, JChan, KEwing, TIbrahim, PNespi, MPham, PShi, SSpevak, WWu, GZhang, JZhang, Y Compounds and methods for kinase modulation, and indications therefor US Patent  US10227357 Publication Date 3/12/2019 
Target
Name:
Mast/stem cell growth factor receptor Kit [D816V]
Synonyms:
KIT Mast/stem cell growth factor receptor Kit (D816V) SCFR | Tyrosine-protein kinase Kit (Kit)(D816V)
Type:
Protein
Mol. Mass.:
109854.42
Organism:
Homo sapiens (Human)
Description:
Human Kit D816V mutant
Residue:
976
  
Inhibitor
Name:
BDBM369338
Synonyms:
N-[4-[6-(2-methoxy-4-pyridyl)-7H- pyrrolo[2,3-d]pyrimidin-4-yl]cyclohex-3- en-1-yl]-4- (trifluoromethoxy)benzenesulfonamide | US10227357, Compound P-0654
Type:
Small organic molecule
Emp. Form.:
C25H22F3N5O4S
Mol. Mass.:
545.533
SMILES:
COc1cc(ccn1)-c1cc2c(ncnc2[nH]1)C1=CCC(CC1)NS(=O)(=O)c1ccc(OC(F)(F)F)cc1
: