Target
Mast/stem cell growth factor receptor Kit [D816V]
Ligand
BDBM369351
Substrate
Meas. Tech.
Cell-Based Assays of c-Kit Mutant Kinase Activity
Ki
500±n/a nM
Citation
 Lin, JBuell, JChan, KEwing, TIbrahim, PNespi, MPham, PShi, SSpevak, WWu, GZhang, JZhang, Y Compounds and methods for kinase modulation, and indications therefor US Patent  US10227357 Publication Date 3/12/2019 
Target
Name:
Mast/stem cell growth factor receptor Kit [D816V]
Synonyms:
KIT Mast/stem cell growth factor receptor Kit (D816V) SCFR | Tyrosine-protein kinase Kit (Kit)(D816V)
Type:
Protein
Mol. Mass.:
109854.42
Organism:
Homo sapiens (Human)
Description:
Human Kit D816V mutant
Residue:
976
  
Inhibitor
Name:
BDBM369351
Synonyms:
4-chloro-N-[1-[6-(1,3-dimethylpyrazol- 4-yl)-7H-pyrrolo[2,3-d]pyrimidin-4-yl]- 4-piperidyl]benzenesulfonamide | US10227357, Compound P-0667
Type:
Small organic molecule
Emp. Form.:
C22H24ClN7O2S
Mol. Mass.:
485.99
SMILES:
Cc1nn(C)cc1-c1cc2c(ncnc2[nH]1)N1CCC(CC1)NS(=O)(=O)c1ccc(Cl)cc1
: