Target
Mast/stem cell growth factor receptor Kit [D816V]
Ligand
BDBM369375
Substrate
Meas. Tech.
Cell-Based Assays of c-Kit Mutant Kinase Activity
Ki
500±n/a nM
Citation
 Lin, JBuell, JChan, KEwing, TIbrahim, PNespi, MPham, PShi, SSpevak, WWu, GZhang, JZhang, Y Compounds and methods for kinase modulation, and indications therefor US Patent  US10227357 Publication Date 3/12/2019 
Target
Name:
Mast/stem cell growth factor receptor Kit [D816V]
Synonyms:
KIT Mast/stem cell growth factor receptor Kit (D816V) SCFR | Tyrosine-protein kinase Kit (Kit)(D816V)
Type:
Protein
Mol. Mass.:
109854.42
Organism:
Homo sapiens (Human)
Description:
Human Kit D816V mutant
Residue:
976
  
Inhibitor
Name:
BDBM369375
Synonyms:
(2R)-4-[6-(4-cyanophenyl)-7H-pyrrolo[2,3- d]pyrimidin-4-yl]-N-[(1S)-1-(3- methoxyphenyl)ethyl]-2-methyl- piperazine-1-carboxamide | US10227357, Compound P-0692
Type:
Small organic molecule
Emp. Form.:
C28H29N7O2
Mol. Mass.:
495.5756
SMILES:
COc1cccc(c1)[C@H](C)NC(=O)N1CCN(C[C@H]1C)c1ncnc2[nH]c(cc12)-c1ccc(cc1)C#N
: