Target
Mast/stem cell growth factor receptor Kit [D816V]
Ligand
BDBM369386
Substrate
Meas. Tech.
Cell-Based Assays of c-Kit Mutant Kinase Activity
Ki
500±n/a nM
Citation
 Lin, JBuell, JChan, KEwing, TIbrahim, PNespi, MPham, PShi, SSpevak, WWu, GZhang, JZhang, Y Compounds and methods for kinase modulation, and indications therefor US Patent  US10227357 Publication Date 3/12/2019 
Target
Name:
Mast/stem cell growth factor receptor Kit [D816V]
Synonyms:
KIT Mast/stem cell growth factor receptor Kit (D816V) SCFR | Tyrosine-protein kinase Kit (Kit)(D816V)
Type:
Protein
Mol. Mass.:
109854.42
Organism:
Homo sapiens (Human)
Description:
Human Kit D816V mutant
Residue:
976
  
Inhibitor
Name:
BDBM369386
Synonyms:
4-[6-(4-fluorophenyl)thieno[3,2- d]pyrimidin-4-yl]-N-[1-(5-methyl-2- thienyl)ethyl]piperazine-1-carboxamide | US10227357, Compound P-0703
Type:
Small organic molecule
Emp. Form.:
C24H24FN5OS2
Mol. Mass.:
481.609
SMILES:
CC(NC(=O)N1CCN(CC1)c1ncnc2cc(sc12)-c1ccc(F)cc1)c1ccc(C)s1
: