Target
Mast/stem cell growth factor receptor Kit
Ligand
BDBM369399
Substrate
Meas. Tech.
Cell-Based Assays of c-Kit Mutant Kinase Activity
Ki
500±n/a nM
Citation
 Lin, JBuell, JChan, KEwing, TIbrahim, PNespi, MPham, PShi, SSpevak, WWu, GZhang, JZhang, Y Compounds and methods for kinase modulation, and indications therefor US Patent  US10227357 Publication Date 3/12/2019 
Target
Name:
Mast/stem cell growth factor receptor Kit
Synonyms:
CD117 antigen KIT Mast/stem cell growth factor receptor Kit (cKIT) Proto-oncogene tyrosine-protein kinase Kit Stem cell growth factor receptor Tyrosine-protein kinase Kit c-kit v-kit Hardy-Zuckerman 4 feline sarcoma viral oncogene homolog
Type:
Protein
Mol. Mass.:
109869.37
Organism:
Homo sapiens (Human)
Description:
P10721
Residue:
976
  
Inhibitor
Name:
BDBM369399
Synonyms:
N-[(1S)-1-(4-fluorophenyl)ethyl]-2,2- dimethyl-4-[6-(1-methylpyrazol-4-yl)-7H- pyrrolo[2,3-d]pyrimidin-4-yl]piperazine-1- carboxamide | US10227357, Compound P-0720
Type:
Small organic molecule
Emp. Form.:
C25H29FN8O
Mol. Mass.:
476.5492
SMILES:
C[C@H](NC(=O)N1CCN(CC1(C)C)c1ncnc2[nH]c(cc12)-c1cnn(C)c1)c1ccc(F)cc1
: