Target
TGF-beta receptor type-1 [4-503,T204D]
Ligand
BDBM21509
Substrate
TGF-beta receptor type I
Meas. Tech.
Enzyme Assay and Luciferase Reporter Assay
pH
7.5±n/a
Temperature
303.15±n/a K
IC50
69±31 nM
EC50
180±93 nM
Citation
 Li, HYMcMillen, WTHeap, CRMcCann, DJYan, LCampbell, RMMundla, SRKing, CHDierks, EAAnderson, BDBritt, KSHuss, KLVoss, MDWang, YClawson, DKYingling, JMSawyer, JS Optimization of a Dihydropyrrolopyrazole Series of Transforming Growth Factor-beta Type I Receptor Kinase Domain Inhibitors: Discovery of an Orally Bioavailable Transforming Growth Factor-beta Receptor Type I Inhibitor as Antitumor Agent. J Med Chem 51:2302-2306 (2008)  
Target
Name:
TGF-beta receptor type-1 [4-503,T204D]
Synonyms:
ALK5 TGF-beta receptor type-1 T204D TGFR-1 T204D | TGFR1_HUMAN
Type:
Enzyme Catalytic Domain
Mol. Mass.:
55650.84
Organism:
Homo sapiens (Human)
Description:
P36897 T204D
Residue:
500
  
Inhibitor
Name:
BDBM21509
Synonyms:
4-[2-({4-[2-(pyridin-2-yl)-4H,5H,6H-pyrrolo[1,2-a]pyrazol-3-yl]quinolin-7-yl}oxy)ethyl]morpholine | Dihydropyrrolopyrazole, 15d
Type:
Small organic molecule
Emp. Form.:
C26H27N5O2
Mol. Mass.:
441.5249
SMILES:
C(CN1CCOCC1)Oc1ccc2c(ccnc2c1)-c1c2CCCn2nc1-c1ccccn1
:
Substrate
Name:
TGF-beta receptor type I
Synonyms:
ALK5 SKR4 TGFR1_HUMAN
Type:
Receptor intracellular domain
Mol. Mass.:
40581.62
Organism:
Homo sapiens (Human)
Description:
The autophosphorylation substrate.
Residue:
356