Target
Galectin-1
Ligand
BDBM21533
Substrate
BDBM21520
Meas. Tech.
Fluorescence Polarization Assay
pH
7.2±n/a
Temperature
297.15±n/a K
Kd
70000±n/a nM
Citation
 Salameh, BASundin, ALeffler, HNilsson, UJ Thioureido N-acetyllactosamine derivatives as potent galectin-7 and 9N inhibitors. Bioorg Med Chem 14:1215-20 (2006)  
Target
Name:
Galectin-1
Synonyms:
14 kDa lectin HPL LGALS1 Lectin galactoside-binding soluble 1 | Putative MAPK-activating protein PM12
Type:
beta galactoside-binding protein
Mol. Mass.:
14713.53
Organism:
Homo sapiens (Human)
Description:
P09382
Residue:
135
  
Inhibitor
Name:
BDBM21533
Synonyms:
N-[(2R,3R,4R,5S,6R)-4-hydroxy-6-(hydroxymethyl)-2-methoxy-5-{[(2S,3R,4S,5R,6R)-3,4,5-trihydroxy-6-(hydroxymethyl)oxan-2-yl]oxy}oxan-3-yl]acetamide | Thioureido N-acetyllactosamine derivative, 17
Type:
Emp. Form.:
C15H27NO11
Mol. Mass.:
397.375
SMILES:
CO[C@@H]1O[C@H](CO)[C@@H](O[C@@H]2O[C@H](CO)[C@H](O)[C@H](O)[C@H]2O)[C@H](O)[C@H]1NC(C)=O
:
Substrate
Name:
BDBM21520
Synonyms:
fluorescein-tagged saccharide
Type:
fluorescent probe
Emp. Form.:
Mol. Mass.:
SMILES:
: