Target
Galectin-8
Ligand
BDBM21523
Substrate
BDBM21520
Meas. Tech.
Fluorescence Polarization Assay
Kd
>3000000±n/a nM
Citation
 Salameh, BASundin, ALeffler, HNilsson, UJ Thioureido N-acetyllactosamine derivatives as potent galectin-7 and 9N inhibitors. Bioorg Med Chem 14:1215-20 (2006)  
Target
Name:
Galectin-8
Synonyms:
Gal-8 LGALS8 Po66 carbohydrate-binding protein Prostate carcinoma tumor antigen 1
Type:
PROTEIN
Mol. Mass.:
35814.23
Organism:
Homo sapiens (Human)
Description:
ChEMBL_1454625
Residue:
317
  
Inhibitor
Name:
BDBM21523
Synonyms:
N-[(2R,3R,4R,5S,6R)-5-{[(2S,3R,4S,5R,6R)-4-[(butylcarbamothioyl)amino]-3,5-dihydroxy-6-(hydroxymethyl)oxan-2-yl]oxy}-4-hydroxy-6-(hydroxymethyl)-2-methoxyoxan-3-yl]acetamide | Thioureido N-acetyllactosamine derivative, 7
Type:
Small organic molecule
Emp. Form.:
C20H37N3O10S
Mol. Mass.:
511.587
SMILES:
CCCCNC(=S)N[C@H]1[C@@H](O)[C@@H](CO)O[C@@H](O[C@H]2[C@H](O)[C@@H](NC(C)=O)[C@H](OC)O[C@@H]2CO)[C@@H]1O
:
Substrate
Name:
BDBM21520
Synonyms:
fluorescein-tagged saccharide
Type:
fluorescent probe
Emp. Form.:
Mol. Mass.:
SMILES:
: