Target
S-methyl-5'-thioadenosine phosphorylase
Ligand
BDBM22110
Substrate
BDBM22111
Meas. Tech.
MTAP/MTAN Inhibition Assay
pH
7±n/a
Temperature
295.15±n/a K
Ki
140±7 nM
Km
5000±n/a nM
Citation
 Evans, GBFurneaux, RHGreatrex, BMurkin, ASSchramm, VLTyler, PC Azetidine based transition state analogue inhibitors of N-ribosyl hydrolases and phosphorylases. J Med Chem 51:948-56 (2008)  
Target
Name:
S-methyl-5'-thioadenosine phosphorylase
Synonyms:
5'-Methylthioadenosine phosphorylase (MTAP) MTA phosphorylase MTAP_HUMAN Methylthioadenosine Phosphorylase (MTAP) | S-methyl-5 -thioadenosine phosphorylase
Type:
Enzyme
Mol. Mass.:
31239.23
Organism:
Homo sapiens (Human)
Description:
Residue:
283
  
Inhibitor
Name:
BDBM22110
Synonyms:
Azetidine based compound, 43 | [1-({4-amino-5H-pyrrolo[3,2-d]pyrimidin-7-yl}methyl)-3-[(methylsulfanyl)methyl]azetidin-3-yl]methanol
Type:
Small organic molecule
Emp. Form.:
C13H19N5OS
Mol. Mass.:
293.388
SMILES:
CSCC1(CO)CN(Cc2c[nH]c3c(N)ncnc23)C1
:
Substrate
Name:
BDBM22111
Synonyms:
(2R,3R,4S,5S)-2-(6-amino-9H-purin-9-yl)-5-[(methylsulfanyl)methyl]oxolane-3,4-diol 5'-Methylthioado CHEMBL277041 | MTA
Type:
Nucleoside or nucleotide
Emp. Form.:
C11H15N5O3S
Mol. Mass.:
297.334
SMILES:
CSC[C@H]1O[C@H]([C@H](O)[C@@H]1O)n1cnc2c(N)ncnc12
: