Target
Legumain
Ligand
BDBM22137
Substrate
BDBM22115
Meas. Tech.
AE Enzyme Inhibition Assay
Temperature
298.15±n/a K
IC50
8±n/a nM
Comments
extracted
Citation
 Götz, MGJames, KEHansell, EDvorák, JSeshaadri, ASojka, DKopácek, PMcKerrow, JHCaffrey, CRPowers, JC Aza-peptidyl Michael Acceptors. A New Class of Potent and Selective Inhibitors of Asparaginyl Endopeptidases (Legumains) from Evolutionarily Diverse Pathogens. J Med Chem 51:2816-32 (2008)  
Target
Name:
Legumain
Synonyms:
Asparaginyl Endopeptidase (AE) | Legumain-like protease precursor
Type:
Enzyme
Mol. Mass.:
49038.15
Organism:
Ixodes ricinus
Description:
IrAE was expressed and produced in Pichia pastoris.
Residue:
441
  
Inhibitor
Name:
BDBM22137
Synonyms:
aza-peptide Michael acceptor, 5q | benzyl N-[(1S)-1-{[(2S)-1-[(2E)-N-benzyl-3-[N-(carbamoylmethyl)hydrazido]-N-(naphthalen-2-ylmethyl)prop-2-enamide]-1-oxopropan-2-yl]carbamoyl}ethyl]carbamate
Type:
Small organic molecule
Emp. Form.:
C38H40N6O7
Mol. Mass.:
692.7602
SMILES:
C[C@H](NC(=O)OCc1ccccc1)C(=O)N[C@@H](C)C(=O)NN(CC(N)=O)C(=O)C=CC(=O)N(Cc1ccccc1)Cc1ccc2ccccc2c1
:
Substrate
Name:
BDBM22115
Synonyms:
Cbz-Ala-Ala-Asn-AMC
Type:
Fluorogenic substrate
Emp. Form.:
Mol. Mass.:
SMILES:
: