Target
Polyunsaturated fatty acid lipoxygenase ALOX15
Ligand
BDBM22265
Substrate
BDBM22231
Meas. Tech.
Enzyme Inhibition Assay
IC50
10±n/a nM
Citation
 Weinstein, DSLiu, WNgu, KLangevine, CCombs, DWZhuang, SChen, CMadsen, CSHarper, TWRobl, JA Discovery of selective imidazole-based inhibitors of mammalian 15-lipoxygenase: highly potent against human enzyme within a cellular environment. Bioorg Med Chem Lett 17:5115-20 (2007)  
Target
Name:
Polyunsaturated fatty acid lipoxygenase ALOX15
Synonyms:
15-Lipoxygenase Arachidonate 15-lipoxygenase LOX15_RABIT | Omega-6 lipoxygenase
Type:
Enzyme
Mol. Mass.:
75309.71
Organism:
Oryctolagus cuniculus (rabbit)
Description:
15-LO enzyme was purified from phenylhydrazine treated rabbits.
Residue:
663
  
Inhibitor
Name:
BDBM22265
Synonyms:
2,4,5-tri-substituted imidazole, 21m | {ethyl[(3R)-1-(2-phenylpropan-2-yl)pyrrolidin-3-yl]sulfamoyl}({2-[5-(4-methoxyphenyl)-2-(thiophen-2-yl)-1H-imidazol-4-yl]ethyl})amine
Type:
Small organic molecule
Emp. Form.:
C31H39N5O3S2
Mol. Mass.:
593.803
SMILES:
[H][C@]1(CCN(C1)C(C)(C)c1ccccc1)N(CC)S(=O)(=O)NCCc1[nH]c(nc1-c1ccc(OC)cc1)-c1cccs1
:
Substrate
Name:
BDBM22231
Synonyms:
(9Z,12Z)-octadeca-9,12-dienoic acid Linoleic Acid | Linoleic acid (LA)
Type:
Unsaturated fatty acid
Emp. Form.:
C18H32O2
Mol. Mass.:
280.4455
SMILES:
CCCCC\C=C/C\C=C/CCCCCCCC(O)=O
: