Target
Polyunsaturated fatty acid lipoxygenase ALOX15
Ligand
BDBM22305
Substrate
BDBM22231
Meas. Tech.
Enzyme Inhibition Assay
IC50
10±n/a nM
Citation
 Weinstein, DSLiu, WGu, ZLangevine, CNgu, KFadnis, LCombs, DWSitkoff, DAhmad, SZhuang, SChen, XWang, FLLoughney, DAAtwal, KSZahler, RMacor, JEMadsen, CSMurugesan, N Tryptamine and homotryptamine-based sulfonamides as potent and selective inhibitors of 15-lipoxygenase. Bioorg Med Chem Lett 15:1435-40 (2005)  
Target
Name:
Polyunsaturated fatty acid lipoxygenase ALOX15
Synonyms:
15-Lipoxygenase Arachidonate 15-lipoxygenase LOX15_RABIT | Omega-6 lipoxygenase
Type:
Enzyme
Mol. Mass.:
75309.71
Organism:
Oryctolagus cuniculus (rabbit)
Description:
15-LO enzyme was purified from phenylhydrazine treated rabbits.
Residue:
663
  
Inhibitor
Name:
BDBM22305
Synonyms:
N-[2-(2-dibenzo[b,d]furan-2-yl-1H-indol-3-yl)ethyl]-4-pentylbenzenesulfonamide tryptamine sulfonamide, 37o
Type:
Small organic molecule
Emp. Form.:
C33H32N2O3S
Mol. Mass.:
536.684
SMILES:
CCCCCc1ccc(cc1)S(=O)(=O)NCCc1c([nH]c2ccccc12)-c1ccc2oc3ccccc3c2c1
:
Substrate
Name:
BDBM22231
Synonyms:
(9Z,12Z)-octadeca-9,12-dienoic acid Linoleic Acid | Linoleic acid (LA)
Type:
Unsaturated fatty acid
Emp. Form.:
C18H32O2
Mol. Mass.:
280.4455
SMILES:
CCCCC\C=C/C\C=C/CCCCCCCC(O)=O
: