Target
Polyunsaturated fatty acid lipoxygenase ALOX15
Ligand
BDBM22314
Substrate
BDBM22231
Meas. Tech.
Enzyme Inhibition Assay
IC50
12±n/a nM
Citation
 Weinstein, DSLiu, WGu, ZLangevine, CNgu, KFadnis, LCombs, DWSitkoff, DAhmad, SZhuang, SChen, XWang, FLLoughney, DAAtwal, KSZahler, RMacor, JEMadsen, CSMurugesan, N Tryptamine and homotryptamine-based sulfonamides as potent and selective inhibitors of 15-lipoxygenase. Bioorg Med Chem Lett 15:1435-40 (2005)  
Target
Name:
Polyunsaturated fatty acid lipoxygenase ALOX15
Synonyms:
15-Lipoxygenase Arachidonate 15-lipoxygenase LOX15_RABIT | Omega-6 lipoxygenase
Type:
Enzyme
Mol. Mass.:
75309.71
Organism:
Oryctolagus cuniculus (rabbit)
Description:
15-LO enzyme was purified from phenylhydrazine treated rabbits.
Residue:
663
  
Inhibitor
Name:
BDBM22314
Synonyms:
4-({2-[2-(1-benzofuran-2-yl)-1H-indol-3-yl]ethyl}sulfamoyl)-N-cyclohexylbenzamide | tryptamine sulfonamide, 40g
Type:
Small organic molecule
Emp. Form.:
C31H31N3O4S
Mol. Mass.:
541.661
SMILES:
O=C(NC1CCCCC1)c1ccc(cc1)S(=O)(=O)NCCc1c([nH]c2ccccc12)-c1cc2ccccc2o1
:
Substrate
Name:
BDBM22231
Synonyms:
(9Z,12Z)-octadeca-9,12-dienoic acid Linoleic Acid | Linoleic acid (LA)
Type:
Unsaturated fatty acid
Emp. Form.:
C18H32O2
Mol. Mass.:
280.4455
SMILES:
CCCCC\C=C/C\C=C/CCCCCCCC(O)=O
: