Target
Prostaglandin G/H synthase 1
Ligand
BDBM22361
Substrate
BDBM22319
Meas. Tech.
COX Inhibitor Screening Assay
pH
8±n/a
Temperature
310.15±n/a K
IC50
1000±n/a nM
Citation
 Rao, PNChen, QHKnaus, EE Synthesis and structure-activity relationship studies of 1,3-diarylprop-2-yn-1-ones: dual inhibitors of cyclooxygenases and lipoxygenases. J Med Chem 49:1668-83 (2006)  
Target
Name:
Prostaglandin G/H synthase 1
Synonyms:
COX1 Cyclooxygenase-1 (COX-1) PTGS1 | Prostaglandin G/H synthase (cyclooxygenase)
Type:
Protein
Mol. Mass.:
68868.60
Organism:
Ovis aries (Sheep)
Description:
Residue:
600
  
Inhibitor
Name:
BDBM22361
Synonyms:
1,3-Diarylprop-2-yn-1-one, 17a | 1-(furan-3-yl)-3-(4-methanesulfonylphenyl)prop-2-yn-1-one
Type:
Small organic molecule
Emp. Form.:
C14H10O4S
Mol. Mass.:
274.292
SMILES:
CS(=O)(=O)c1ccc(cc1)C#CC(=O)c1ccoc1
:
Substrate
Name:
BDBM22319
Synonyms:
(5Z,8Z,11Z,14Z)-icosa-5,8,11,14-tetraenoic acid Arachidonic acid (AA) [1-14C]Arachidonic acid
Type:
Unsaturated fatty acid
Emp. Form.:
C20H32O2
Mol. Mass.:
304.4669
SMILES:
CCCCC\C=C/C\C=C/C\C=C/C\C=C/CCCC(O)=O
: