Target
Prostaglandin G/H synthase 2
Ligand
BDBM22354
Substrate
BDBM22319
Meas. Tech.
COX Inhibitor Screening Assay
IC50
10000±n/a nM
Citation
 Rao, PNChen, QHKnaus, EE Synthesis and structure-activity relationship studies of 1,3-diarylprop-2-yn-1-ones: dual inhibitors of cyclooxygenases and lipoxygenases. J Med Chem 49:1668-83 (2006)  
Target
Name:
Prostaglandin G/H synthase 2
Synonyms:
COX2 Cyclooxygenase 2 (COX-2) Cyclooxygenase-2 (COX-2 AA) Cyclooxygenase-2 (COX-2) PGH2_HUMAN PHS II Prostaglandin E synthase/G/H synthase 2 Prostaglandin-endoperoxide synthase 2
Type:
Enzyme
Mol. Mass.:
69003.89
Organism:
Homo sapiens (Human)
Description:
Recombinant Cox-2 provided by Cayman (Cayman Chemical Co.,Ann Arbor, MI).
Residue:
604
  
Inhibitor
Name:
BDBM22354
Synonyms:
1,3-Diarylprop-2-yn-1-one, 13k CHEMBL194297
Type:
Small organic molecule
Emp. Form.:
C16H12O4S
Mol. Mass.:
300.329
SMILES:
CS(=O)(=O)c1ccc(cc1)C#CC(=O)c1ccc(O)cc1
:
Substrate
Name:
BDBM22319
Synonyms:
(5Z,8Z,11Z,14Z)-icosa-5,8,11,14-tetraenoic acid Arachidonic acid (AA) [1-14C]Arachidonic acid
Type:
Unsaturated fatty acid
Emp. Form.:
C20H32O2
Mol. Mass.:
304.4669
SMILES:
CCCCC\C=C/C\C=C/C\C=C/C\C=C/CCCC(O)=O
: