Target
Lipoxygenase
Ligand
BDBM22363
Substrate
BDBM22231
Meas. Tech.
COX Inhibitor Screening Assay
IC50
>10000±n/a nM
Citation
 Rao, PNChen, QHKnaus, EE Synthesis and structure-activity relationship studies of 1,3-diarylprop-2-yn-1-ones: dual inhibitors of cyclooxygenases and lipoxygenases. J Med Chem 49:1668-83 (2006)  
Target
Name:
Lipoxygenase
Synonyms:
5-Lipoxygenase | 5-Lipoxygenase (5-LO)
Type:
Enzyme
Mol. Mass.:
97294.59
Organism:
Solanum tuberosum (potato)
Description:
Residue:
864
  
Inhibitor
Name:
BDBM22363
Synonyms:
1,3-Diarylprop-2-yn-1-one, 17c | 3-(4-methanesulfonylphenyl)-1-(4-methoxynaphthalen-1-yl)prop-2-yn-1-one
Type:
Small organic molecule
Emp. Form.:
C21H16O4S
Mol. Mass.:
364.414
SMILES:
COc1ccc(C(=O)C#Cc2ccc(cc2)S(C)(=O)=O)c2ccccc12
:
Substrate
Name:
BDBM22231
Synonyms:
(9Z,12Z)-octadeca-9,12-dienoic acid Linoleic Acid | Linoleic acid (LA)
Type:
Unsaturated fatty acid
Emp. Form.:
C18H32O2
Mol. Mass.:
280.4455
SMILES:
CCCCC\C=C/C\C=C/CCCCCCCC(O)=O
: