Target
Sodium-dependent dopamine transporter
Ligand
BDBM22396
Substrate
BDBM22397
Meas. Tech.
Ligand Binding Assay
pH
7.4±n/a
Temperature
277.15±n/a K
IC50
23±n/a nM
Citation
 Gong, PKBlough, BEBrieaddy, LEHuang, XKuhar, MJNavarro, HACarroll, FI Synthesis, monoamine transporter binding, properties, and functional monoamine uptake activity of 3beta-[4-methylphenyl and 4-chlorophenyl]-2 beta-[5-(substituted phenyl)thiazol-2-yl]tropanes. J Med Chem 50:3686-95 (2007)  
Target
Name:
Sodium-dependent dopamine transporter
Synonyms:
DA transporter SC6A3_RAT Sodium-dependent dopamine transporter | Sodium-dependent dopamine transporter (DAT)
Type:
Multi-pass membrane protein
Mol. Mass.:
68749.45
Organism:
Rattus norvegicus (rat)
Description:
P23977
Residue:
619
  
Inhibitor
Name:
BDBM22396
Synonyms:
(1R,2S,3S,5S)-3-(4-chlorophenyl)-2-[5-(4-fluorophenyl)-1,3-thiazol-2-yl]-8-methyl-8-azabicyclo[3.2.1]octane WIN35,065-2 methyl (1R,2S,3S,5S)-8-methyl-3-phenyl-8-azabicyclo[3.2.1]octane-2-carboxylate | troparil, 1R-(exo,exo)-isomer
Type:
Small organic molecule
Emp. Form.:
C16H21NO2
Mol. Mass.:
259.3434
SMILES:
COC(=O)[C@@H]1[C@H]2CC[C@@H](C[C@@H]1c1ccccc1)N2C
:
Substrate
Name:
BDBM22397
Synonyms:
WIN 35,428 methyl (1R,2S,3S,5S)-3-(4-fluorophenyl)-8-methyl-8-azabicyclo[3.2.1]octane-2-carboxylate
Type:
radiolabeled ligand
Emp. Form.:
C16H20FNO2
Mol. Mass.:
277.3339
SMILES:
COC(=O)[C@@H]1[C@H]2CC[C@@H](C[C@@H]1c1ccc(F)cc1)N2C
: