Target
Sodium-dependent serotonin transporter
Ligand
BDBM22414
Substrate
BDBM22416
Meas. Tech.
Ligand Binding Assay
Ki
190±n/a nM
Citation
 Gong, PKBlough, BEBrieaddy, LEHuang, XKuhar, MJNavarro, HACarroll, FI Synthesis, monoamine transporter binding, properties, and functional monoamine uptake activity of 3beta-[4-methylphenyl and 4-chlorophenyl]-2 beta-[5-(substituted phenyl)thiazol-2-yl]tropanes. J Med Chem 50:3686-95 (2007)  
Target
Name:
Sodium-dependent serotonin transporter
Synonyms:
5-HT Transporter 5HT transporter Anandamid membrane transporter, AMT Monoamine transporters; Norepinephrine & serotonin Slc6a4 Sodium-dependent serotonin transporter (SERT) | imipramine receptor
Type:
Multi-pass membrane protein
Mol. Mass.:
70168.43
Organism:
Rattus norvegicus (rat)
Description:
P31652
Residue:
630
  
Inhibitor
Name:
BDBM22414
Synonyms:
5-(3,4-dichlorophenyl)-2-[(1R,2S,3S,5S)-8-methyl-3-(4-methylphenyl)-8-azabicyclo[3.2.1]octan-2-yl]-1,3-thiazole | WIN 35,065-2 Analogue, 4r
Type:
Small organic molecule
Emp. Form.:
C24H24Cl2N2S
Mol. Mass.:
443.432
SMILES:
CN1[C@H]2CC[C@@H]1[C@H]([C@H](C2)c1ccc(C)cc1)c1ncc(s1)-c1ccc(Cl)c(Cl)c1
:
Substrate
Name:
BDBM22416
Synonyms:
(3S,4R)-3-[(1,3-benzodioxol-5-yloxy)methyl]-4-(4-fluorophenyl)piperidine CHEMBL490 US09969700, Paroxetine [3H]Paroxetine
Type:
radiolabeled ligand
Emp. Form.:
C19H20FNO3
Mol. Mass.:
329.3654
SMILES:
Fc1ccc(cc1)[C@@H]1CCNC[C@H]1COc1ccc2OCOc2c1
: