Target
Sodium-dependent serotonin transporter
Ligand
BDBM22412
Substrate
BDBM22166
Meas. Tech.
Ligand Binding Assay
Ki
580±n/a nM
EC50
2380±n/a nM
Citation
 Gong, PKBlough, BEBrieaddy, LEHuang, XKuhar, MJNavarro, HACarroll, FI Synthesis, monoamine transporter binding, properties, and functional monoamine uptake activity of 3beta-[4-methylphenyl and 4-chlorophenyl]-2 beta-[5-(substituted phenyl)thiazol-2-yl]tropanes. J Med Chem 50:3686-95 (2007)  
Target
Name:
Sodium-dependent serotonin transporter
Synonyms:
5-HT Transporter 5HTT SC6A4_HUMAN SLC6A4 Serotonin transporter (5HTT) Sodium-dependent serotonin transporter (SERT) | Solute carrier family 6 member 4
Type:
Multi-pass membrane protein
Mol. Mass.:
70322.51
Organism:
Homo sapiens (Human)
Description:
P31645
Residue:
630
  
Inhibitor
Name:
BDBM22412
Synonyms:
2-[(1R,2S,3S,5S)-8-methyl-3-(4-methylphenyl)-8-azabicyclo[3.2.1]octan-2-yl]-5-(3-nitrophenyl)-1,3-thiazole | WIN 35,065-2 Analogue, 4p
Type:
Small organic molecule
Emp. Form.:
C24H25N3O2S
Mol. Mass.:
419.539
SMILES:
CN1[C@H]2CC[C@@H]1[C@H]([C@H](C2)c1ccc(C)cc1)c1ncc(s1)-c1cccc(c1)[N+]([O-])=O
:
Substrate
Name:
BDBM22166
Synonyms:
3-(4-iodophenyl)tropane-2-carboxylic acid methyl ester CHEMBL215376 RTI-258 [125I]RTI-55 | methyl (1R,2S,3S,5S)-3-(4-iodophenyl)-8-methyl-8-azabicyclo[3.2.1]octane-2-carboxylate
Type:
radiolabeled ligand
Emp. Form.:
C16H20INO2
Mol. Mass.:
385.24
SMILES:
[H][C@]12CC[C@]([H])([C@H]([C@H](C1)c1ccc(I)cc1)C(=O)OC)N2C
: