Target
Estrogen receptor
Ligand
BDBM22436
Substrate
[3H]]estradiol
Meas. Tech.
Radioligand Displacement Assay
pH
7.4±n/a
Temperature
295.15±n/a K
IC50
79±n/a nM
Citation
 Chao, EYCollins, JLGaillard, SMiller, ABWang, LOrband-Miller, LANolte, RTMcDonnell, DPWillson, TMZuercher, WJ Structure-guided synthesis of tamoxifen analogs with improved selectivity for the orphan ERRgamma. Bioorg Med Chem Lett 16:821-4 (2006)  
Target
Name:
Estrogen receptor
Synonyms:
ER ESR ESR1_HUMAN Estrogen receptor Estrogen receptor (ER-alpha) Estrogen receptor alpha (ER) Nuclear receptor subfamily 3 group A member 1
Type:
Protein
Mol. Mass.:
66230.44
Organism:
Homo sapiens (Human)
Description:
P03372
Residue:
595
  
Inhibitor
Name:
BDBM22436
Synonyms:
4-[(1Z)-1-{4-[2-(dimethylamino)ethoxy]phenyl}-6-hydroxy-2-phenylhex-1-en-1-yl]phenol | 4-hydroxytamoxifen (4-OHT) analog, 16
Type:
Small organic molecule
Emp. Form.:
C28H33NO3
Mol. Mass.:
431.5665
SMILES:
CN(C)CCOc1ccc(cc1)C(=C(\CCCCO)c1ccccc1)\c1ccc(O)cc1
:
Substrate
Name:
BDBM17292
Synonyms:
(1S,10R,11S,14S,15S)-15-methyltetracyclo[8.7.0.0^{2,7}.0^{11,15}]heptadeca-2,4,6-triene-5,14-diol 17α-ethinylestradiol CHEMBL135 ESTRADIOL Ovocyclin US9040509, E2 US9561238, E2 [2,4,6,7-3H]-E2 [3H]]estradiol
Type:
Steroid
Emp. Form.:
C18H24O2
Mol. Mass.:
272.382
SMILES:
[H][C@@]12CC[C@H](O)[C@@]1(C)CC[C@]1([H])c3ccc(O)cc3CC[C@@]21[H]
: