Target
Estrogen-related receptor gamma
Ligand
BDBM20608
Substrate
Biotinylated RIP140 peptide
Meas. Tech.
ERRgamma FRET Assay
pH
7±n/a
Temperature
295.15±n/a K
EC50
15±n/a nM
Citation
 Zuercher, WJGaillard, SOrband-Miller, LAChao, EYShearer, BGJones, DGMiller, ABCollins, JLMcDonnell, DPWillson, TM Identification and structure-activity relationship of phenolic acyl hydrazones as selective agonists for the estrogen-related orphan nuclear receptors ERRbeta and ERRgamma. J Med Chem 48:3107-9 (2005)  
Target
Name:
Estrogen-related receptor gamma
Synonyms:
ERR gamma-2 ERR3_HUMAN ESRRG Estrogen-Related Receptor, gamma KIAA0832 Nuclear receptor subfamily 3 group B member 3
Type:
PROTEIN
Mol. Mass.:
51305.00
Organism:
Homo sapiens (Human)
Description:
ChEMBL_1501351
Residue:
458
  
Inhibitor
Name:
BDBM20608
Synonyms:
4-Hydroxytamoxifen 4-[(1Z)-1-{4-[2-(dimethylamino)ethoxy]phenyl}-2-phenylbut-1-en-1-yl]phenol CHEMBL489 cid_449459
Type:
Small organic molecule
Emp. Form.:
C26H29NO2
Mol. Mass.:
387.514
SMILES:
CC\C(=C(/c1ccc(O)cc1)c1ccc(OCCN(C)C)cc1)c1ccccc1
:
Substrate
Name:
Biotinylated RIP140 peptide (aa 366-390)
Synonyms:
NRIP1 Nuclear factor RIP140, 366-390 | Receptor-interacting protein 140 derived peptide
Type:
Peptide
Mol. Mass.:
2831.78
Organism:
Homo sapiens (Human)
Description:
P48552[366-390]
Residue:
25