Target
Estrogen-related receptor gamma
Ligand
BDBM22442
Substrate
Biotinylated RIP140 peptide
Meas. Tech.
ERRgamma FRET Assay
pH
7±n/a
Temperature
295.15±n/a K
EC50
1600±n/a nM
Citation
 Zuercher, WJGaillard, SOrband-Miller, LAChao, EYShearer, BGJones, DGMiller, ABCollins, JLMcDonnell, DPWillson, TM Identification and structure-activity relationship of phenolic acyl hydrazones as selective agonists for the estrogen-related orphan nuclear receptors ERRbeta and ERRgamma. J Med Chem 48:3107-9 (2005)  
Target
Name:
Estrogen-related receptor gamma
Synonyms:
ERR gamma-2 ERR3_HUMAN ESRRG Estrogen-Related Receptor, gamma KIAA0832 Nuclear receptor subfamily 3 group B member 3
Type:
PROTEIN
Mol. Mass.:
51305.00
Organism:
Homo sapiens (Human)
Description:
ChEMBL_1501351
Residue:
458
  
Inhibitor
Name:
BDBM22442
Synonyms:
Acyl Hydrazone, 7 | N'-[(1E)-[4-(diethylamino)phenyl]methylidene]benzohydrazide
Type:
Small organic molecule
Emp. Form.:
C18H21N3O
Mol. Mass.:
295.3788
SMILES:
CCN(CC)c1ccc(\C=N\NC(=O)c2ccccc2)cc1
:
Substrate
Name:
Biotinylated RIP140 peptide (aa 366-390)
Synonyms:
NRIP1 Nuclear factor RIP140, 366-390 | Receptor-interacting protein 140 derived peptide
Type:
Peptide
Mol. Mass.:
2831.78
Organism:
Homo sapiens (Human)
Description:
P48552[366-390]
Residue:
25