Target
Free fatty acid receptor 4
Ligand
BDBM261561
Substrate
Meas. Tech.
FLIPR Assay
EC50
1215±n/a nM
Citation
 Chelliah, MChu, HDCox, JMDebenham, JSEagen, KLan, PLondon, CPlotkin, MAShah, USinz, CJSun, ZVaccaro, HMVenkatraman, S Substituted spiropiperidinyl compounds useful as GPR120 agonists US Patent  US9708270 Publication Date 7/18/2017 
Target
Name:
Free fatty acid receptor 4
Synonyms:
FFAR4 G-protein coupled receptor 120 G-protein coupled receptor GT01 GPR120 O3FAR1 PGR4
Type:
PROTEIN
Mol. Mass.:
42256.91
Organism:
Homo sapiens (Human)
Description:
ChEMBL_1508994
Residue:
377
  
Inhibitor
Name:
BDBM261561
Synonyms:
US9708270, 56
Type:
Small organic molecule
Emp. Form.:
C22H30F3NO4
Mol. Mass.:
429.4731
SMILES:
CC(C)Oc1cc(OC(F)(F)F)cc(c1)N1CCC2(CCC(CC(O)=O)CC2)CC1
: