Target
Trifunctional purine biosynthetic protein adenosine-3
Ligand
BDBM22590
Substrate
BDBM22589
Meas. Tech.
GAR Tfase Activity Assay
pH
7.5±n/a
Temperature
299.15±n/a K
Ki
60±n/a nM
Citation
 Xu, LChong, YHwang, ID'Onofrio, AAmore, KBeardsley, GPLi, COlson, AJBoger, DLWilson, IA Structure-based design, synthesis, evaluation, and crystal structures of transition state analogue inhibitors of inosine monophosphate cyclohydrolase. J Biol Chem 282:13033-46 (2007)  
Target
Name:
Trifunctional purine biosynthetic protein adenosine-3
Synonyms:
GAR Tfase GART Glycinamide ribonucleotide transformylase (GAR Tfase) PRGS Thymidylate synthase/GAR transformylase/AICAR transformylase
Type:
Protein
Mol. Mass.:
107768.47
Organism:
Homo sapiens (Human)
Description:
P22102
Residue:
1010
  
Inhibitor
Name:
BDBM22590
Synonyms:
(2S)-2-[(4-{2-[(6R)-2-amino-4-oxo-1H,4H,5H,6H,7H,8H-pyrido[2,3-d]pyrimidin-6-yl]ethyl}phenyl)formamido]pentanedioic acid DDATHF Lometrexol
Type:
Antimetabolite
Emp. Form.:
C21H25N5O6
Mol. Mass.:
443.4531
SMILES:
Nc1nc2NC[C@H](CCc3ccc(cc3)C(=O)N[C@@H](CCC(O)=O)C(O)=O)Cc2c(=O)[nH]1
:
Substrate
Name:
BDBM22589
Synonyms:
GAR glycineamide ribonucleotide | {[(2R,3S,4R,5R)-5-(2-aminoacetamido)-3,4-dihydroxyoxolan-2-yl]methoxy}phosphonic acid
Type:
Nucleoside or nucleotide
Emp. Form.:
C7H15N2O8P
Mol. Mass.:
286.1764
SMILES:
NCC(=O)N[C@@H]1O[C@H](COP(O)(O)=O)[C@@H](O)[C@H]1O
: