Target
High affinity nerve growth factor receptor
Ligand
BDBM373112
Substrate
Meas. Tech.
TrkA Receptor
IC50
1400±n/a nM
Citation
 Cooke, AJStump, CAZhang, XLi, CSMao, Q TrkA kinase inhibitors, compositions and methods thereof US Patent  US9896447 Publication Date 2/20/2018 
Target
Name:
High affinity nerve growth factor receptor
Synonyms:
2.7.10.1 NTRK1 NTRK1_HUMAN Neurotrophic tyrosine kinase receptor type 1 Synonyms=MTC TRK1-transforming tyrosine kinase protein TRKA GN Tropomyosin alpha-3 chain/High affinity nerve growth factor receptor Tropomyosin-related kinase A (TrkA) Tyrosine kinase receptor (Trk) Tyrosine kinase receptor A (Trk A) Tyrosine kinase receptor A (TrkA) p140-TrkA
Type:
Mol. Mass.:
87498.18
Organism:
Homo sapiens (Human)
Description:
P04629
Residue:
796
  
Inhibitor
Name:
BDBM373112
Synonyms:
1-(2- phenylimidazo[1,2- a]pyridin-3-yl)-3-[2- (1H-pyrazol-1- yl)imidazo[1,2- a]pyridin-3-yl]urea | US9896447, Compound 29
Type:
Small organic molecule
Emp. Form.:
C24H18N8O
Mol. Mass.:
434.4527
SMILES:
O=C(Nc1c(nc2ccccn12)-c1ccccc1)Nc1c(nc2ccccn12)-n1cccn1
: