Target
Liver carboxylesterase 1
Ligand
BDBM22729
Substrate
BDBM22723
Meas. Tech.
Enzyme Inhibition Assay
Ki
>100000±n/a nM
Citation
 Wadkins, RMHyatt, JLWei, XYoon, KJWierdl, MEdwards, CCMorton, CLObenauer, JCDamodaran, KBeroza, PDanks, MKPotter, PM Identification and characterization of novel benzil (diphenylethane-1,2-dione) analogues as inhibitors of mammalian carboxylesterases. J Med Chem 48:2906-15 (2005)  
Target
Name:
Liver carboxylesterase 1
Synonyms:
Acyl coenzyme A:cholesterol acyltransferase CES1 EST1_HUMAN Serine hydrolase (CES1)
Type:
Protein
Mol. Mass.:
62520.83
Organism:
Homo sapiens (Human)
Description:
Residue:
567
  
Inhibitor
Name:
BDBM22729
Synonyms:
1,2-Diphenylethane-1,2-diol
Type:
Small organic molecule
Emp. Form.:
C14H14O2
Mol. Mass.:
214.2598
SMILES:
OC(C(O)c1ccccc1)c1ccccc1
:
Substrate
Name:
BDBM22723
Synonyms:
2-nitrophenyl acetate o-NPA | o-nitrophenyl acetate
Type:
Small organic molecule
Emp. Form.:
C8H7NO4
Mol. Mass.:
181.1455
SMILES:
CC(=O)Oc1ccccc1[N+]([O-])=O
: