Target
Liver carboxylesterase 1
Ligand
BDBM22740
Substrate
BDBM22723
Meas. Tech.
Enzyme Inhibition Assay
Ki
49.6±n/a nM
Citation
 Wadkins, RMHyatt, JLWei, XYoon, KJWierdl, MEdwards, CCMorton, CLObenauer, JCDamodaran, KBeroza, PDanks, MKPotter, PM Identification and characterization of novel benzil (diphenylethane-1,2-dione) analogues as inhibitors of mammalian carboxylesterases. J Med Chem 48:2906-15 (2005)  
Target
Name:
Liver carboxylesterase 1
Synonyms:
Carboxylesterase 1 liver carboxylesterase 1 | rCE
Type:
Enzyme
Mol. Mass.:
62292
Organism:
Oryctolagus cuniculus (rabbit)
Description:
Residue:
565
  
Inhibitor
Name:
BDBM22740
Synonyms:
1,2-bis(4-methylphenyl)ethane-1,2-dione | Benzil-based compound, 18
Type:
Small organic molecule
Emp. Form.:
C16H14O2
Mol. Mass.:
238.2812
SMILES:
Cc1ccc(cc1)C(=O)C(=O)c1ccc(C)cc1
:
Substrate
Name:
BDBM22723
Synonyms:
2-nitrophenyl acetate o-NPA | o-nitrophenyl acetate
Type:
Small organic molecule
Emp. Form.:
C8H7NO4
Mol. Mass.:
181.1455
SMILES:
CC(=O)Oc1ccccc1[N+]([O-])=O
: