Target
Orexin receptor type 2
Ligand
BDBM50384427
Substrate
Meas. Tech.
Cell-based Functional Assay
IC50
17.0±n/a nM
Citation
 Kamenecka, TMHe, YNguyen, WJiang, RSong, XHerr, RJJiang, Q Substituted prolines/piperidines as orexin receptor antagonists US Patent  US9896452 Publication Date 2/20/2018 
Target
Name:
Orexin receptor type 2
Synonyms:
HCRTR2 OX2R_HUMAN Orexin receptor type 2 (OR-2) Orexin receptor type 2 (OX2R) Ox-2-R | Ox2-R
Type:
Protein
Mol. Mass.:
50710.53
Organism:
Homo sapiens (Human)
Description:
O43614
Residue:
444
  
Inhibitor
Name:
BDBM50384427
Synonyms:
CHEMBL2031490 | US9896452, Example 139
Type:
Small organic molecule
Emp. Form.:
C27H24F3N3O3S
Mol. Mass.:
527.558
SMILES:
Cc1nc(C(=O)N2CCC[C@H]([C@H]2CNC(=O)c2cccc3occc23)C(F)(F)F)c(s1)-c1ccccc1
: