Target
Receptor-interacting serine/threonine-protein kinase 1
Ligand
BDBM356237
Substrate
Meas. Tech.
Fluorescent Polarization Binding (FP Binding) assay
IC50
500±n/a nM
Citation
 Estrada, AAFeng, JAFox, BSweeney, ZK Compounds, compositions and methods US Patent  US9896458 Publication Date 2/20/2018 
Target
Name:
Receptor-interacting serine/threonine-protein kinase 1
Synonyms:
Cell death protein RIP RIP-1 RIPK1 Receptor-interacting protein 1
Type:
Enzyme Catalytic Domain
Mol. Mass.:
75926.99
Organism:
Homo sapiens (Human)
Description:
Q13546
Residue:
671
  
Inhibitor
Name:
BDBM356237
Synonyms:
US10604535, Example 7 US9896458, No. 7
Type:
Small organic molecule
Emp. Form.:
C23H21N3O3
Mol. Mass.:
387.4311
SMILES:
CN1c2ccccc2C2CC2[C@H](NC(=O)c2cc(Cc3ccccc3)on2)C1=O
: