Target
Liver carboxylesterase 1
Ligand
BDBM22816
Substrate
BDBM22723
Meas. Tech.
Enzyme Inhibition Assay
Ki
360±n/a nM
Citation
 Hyatt, JLMoak, THatfield, MJTsurkan, LEdwards, CCWierdl, MDanks, MKWadkins, RMPotter, PM Selective inhibition of carboxylesterases by isatins, indole-2,3-diones. J Med Chem 50:1876-85 (2007)  
Target
Name:
Liver carboxylesterase 1
Synonyms:
Carboxylesterase 1 liver carboxylesterase 1 | rCE
Type:
Enzyme
Mol. Mass.:
62292
Organism:
Oryctolagus cuniculus (rabbit)
Description:
Residue:
565
  
Inhibitor
Name:
BDBM22816
Synonyms:
5-(trifluoromethoxy)-2,3-dihydro-1H-indole-2,3-dione | Isatin-based compound, 36
Type:
Small organic molecule
Emp. Form.:
C9H4F3NO3
Mol. Mass.:
231.1282
SMILES:
FC(F)(F)Oc1ccc2NC(=O)C(=O)c2c1
:
Substrate
Name:
BDBM22723
Synonyms:
2-nitrophenyl acetate o-NPA | o-nitrophenyl acetate
Type:
Small organic molecule
Emp. Form.:
C8H7NO4
Mol. Mass.:
181.1455
SMILES:
CC(=O)Oc1ccccc1[N+]([O-])=O
: