Target
Liver carboxylesterase 1
Ligand
BDBM22818
Substrate
BDBM22723
Meas. Tech.
Enzyme Inhibition Assay
Ki
130±n/a nM
Citation
 Hyatt, JLMoak, THatfield, MJTsurkan, LEdwards, CCWierdl, MDanks, MKWadkins, RMPotter, PM Selective inhibition of carboxylesterases by isatins, indole-2,3-diones. J Med Chem 50:1876-85 (2007)  
Target
Name:
Liver carboxylesterase 1
Synonyms:
Carboxylesterase 1 liver carboxylesterase 1 | rCE
Type:
Enzyme
Mol. Mass.:
62292
Organism:
Oryctolagus cuniculus (rabbit)
Description:
Residue:
565
  
Inhibitor
Name:
BDBM22818
Synonyms:
5-bromo-1-(2-methylprop-2-en-1-yl)-2,3-dihydro-1H-indole-2,3-dione | Isatin-based compound, 38
Type:
Small organic molecule
Emp. Form.:
C12H10BrNO2
Mol. Mass.:
280.117
SMILES:
CC(=C)CN1C(=O)C(=O)c2cc(Br)ccc12
:
Substrate
Name:
BDBM22723
Synonyms:
2-nitrophenyl acetate o-NPA | o-nitrophenyl acetate
Type:
Small organic molecule
Emp. Form.:
C8H7NO4
Mol. Mass.:
181.1455
SMILES:
CC(=O)Oc1ccccc1[N+]([O-])=O
: