Target
Acetylcholinesterase
Ligand
BDBM22796
Substrate
BDBM8959
Meas. Tech.
Enzyme Inhibition Assay
Ki
48200±n/a nM
Citation
 Hyatt, JLMoak, THatfield, MJTsurkan, LEdwards, CCWierdl, MDanks, MKWadkins, RMPotter, PM Selective inhibition of carboxylesterases by isatins, indole-2,3-diones. J Med Chem 50:1876-85 (2007)  
Target
Name:
Acetylcholinesterase
Synonyms:
ACES_HUMAN Acetylcholinesterase (AChE) | Acetylcholinesterase (human AChE)
Type:
Enzyme
Mol. Mass.:
67792.70
Organism:
Homo sapiens (Human)
Description:
P22303
Residue:
614
  
Inhibitor
Name:
BDBM22796
Synonyms:
1-[(3,4-dichlorophenyl)methyl]-2,3-dihydro-1H-indole-2,3-dione cid_1901244
Type:
Small organic molecule
Emp. Form.:
C15H9Cl2NO2
Mol. Mass.:
306.143
SMILES:
Clc1ccc(CN2C(=O)C(=O)c3ccccc23)cc1Cl
:
Substrate
Name:
BDBM8959
Synonyms:
(2-Mercaptoethyl)trimethylammonium iodide acetate Acetylthiocholine acetylthiocholine chloride | acetylthiocholine iodide
Type:
Small organic molecule
Emp. Form.:
C7H16NOS
Mol. Mass.:
162.272
SMILES:
CC(=O)SCC[N+](C)(C)C
: