Target
Acetylcholinesterase
Ligand
BDBM22840
Substrate
BDBM8959
Meas. Tech.
Enzyme Inhibition Assay
Ki
>100000±n/a nM
Citation
 Hyatt, JLMoak, THatfield, MJTsurkan, LEdwards, CCWierdl, MDanks, MKWadkins, RMPotter, PM Selective inhibition of carboxylesterases by isatins, indole-2,3-diones. J Med Chem 50:1876-85 (2007)  
Target
Name:
Acetylcholinesterase
Synonyms:
ACES_HUMAN Acetylcholinesterase (AChE) | Acetylcholinesterase (human AChE)
Type:
Enzyme
Mol. Mass.:
67792.70
Organism:
Homo sapiens (Human)
Description:
P22303
Residue:
614
  
Inhibitor
Name:
BDBM22840
Synonyms:
1-(piperidin-1-ylmethyl)-2,3-dihydro-1H-indole-2,3-dione | Isatin-based compound, 60
Type:
Small organic molecule
Emp. Form.:
C14H16N2O2
Mol. Mass.:
244.289
SMILES:
O=C1N(CN2CCCCC2)c2ccccc2C1=O
:
Substrate
Name:
BDBM8959
Synonyms:
(2-Mercaptoethyl)trimethylammonium iodide acetate Acetylthiocholine acetylthiocholine chloride | acetylthiocholine iodide
Type:
Small organic molecule
Emp. Form.:
C7H16NOS
Mol. Mass.:
162.272
SMILES:
CC(=O)SCC[N+](C)(C)C
: