Target
Liver carboxylesterase 1
Ligand
BDBM22845
Substrate
BDBM22723
Meas. Tech.
Enzyme Inhibition Assay
Ki
8±n/a nM
Citation
 Hyatt, JLMoak, THatfield, MJTsurkan, LEdwards, CCWierdl, MDanks, MKWadkins, RMPotter, PM Selective inhibition of carboxylesterases by isatins, indole-2,3-diones. J Med Chem 50:1876-85 (2007)  
Target
Name:
Liver carboxylesterase 1
Synonyms:
Acyl coenzyme A:cholesterol acyltransferase CES1 EST1_HUMAN Serine hydrolase (CES1)
Type:
Protein
Mol. Mass.:
62520.83
Organism:
Homo sapiens (Human)
Description:
Residue:
567
  
Inhibitor
Name:
BDBM22845
Synonyms:
1-{[4-({4-[(2,3-dioxo-2,3-dihydro-1H-indol-1-yl)methyl]phenyl}methyl)phenyl]methyl}-2,3-dihydro-1H-indole-2,3-dione | Isatin-based compound, 65
Type:
Small organic molecule
Emp. Form.:
C31H22N2O4
Mol. Mass.:
486.5174
SMILES:
O=C1N(Cc2ccc(Cc3ccc(CN4C(=O)C(=O)c5ccccc45)cc3)cc2)c2ccccc2C1=O
:
Substrate
Name:
BDBM22723
Synonyms:
2-nitrophenyl acetate o-NPA | o-nitrophenyl acetate
Type:
Small organic molecule
Emp. Form.:
C8H7NO4
Mol. Mass.:
181.1455
SMILES:
CC(=O)Oc1ccccc1[N+]([O-])=O
: