Target
Interleukin-1 receptor-associated kinase 4
Ligand
BDBM374371
Substrate
Meas. Tech.
Cell-Based Assay
EC50
<1000±n/a nM
Citation
 Chan, TGuckian, KJenkins, TThomas, JVessels, JKumaravel, GMeissner, RLyssikatos, JLucas, BLeaf, IDuffield, J IRAK4 inhibiting agents US Patent  US10246456 Publication Date 4/2/2019 
Target
Name:
Interleukin-1 receptor-associated kinase 4
Synonyms:
IRAK-4 IRAK4_HUMAN Interleukin-1 receptor-associated kinase 4 (IRAK4) | Renal carcinoma antigen NY-REN-64
Type:
Protein
Mol. Mass.:
51519.08
Organism:
Homo sapiens (Human)
Description:
Q9NWZ3
Residue:
460
  
Inhibitor
Name:
BDBM374371
Synonyms:
US10246456, Example 524 | US10577367, Example 524
Type:
Small organic molecule
Emp. Form.:
C23H22N6O2
Mol. Mass.:
414.4598
SMILES:
C[C@H](N)c1cccc(n1)-c1cc(C2=NCCO2)c2cnn(-c3cccc(CO)n3)c2c1
: